{"text_format":"1","workbook":"xlsx","n_sheets":13,"sheets":["Quick Quote Tool","Quote","Rate Card","KEY FEATURES","General Questionnaire","App Questionnaire","Server Questionnaire","Summary - Manual","Dropdown","User Information","Order Summary","Instructions","Price Quote - Manual"],"not_rendered":{"charts":0,"images":1,"macros":1,"external_links":2,"defined_names":211,"comments":0,"pivot_tables":0},"unopened":[],"bounds":{"document_bytes":16777216,"sheet_cells":100000,"rows_first":2000,"rows_last":500,"rows_between":2000,"halvings":0,"cell_chars":16384,"cell_head_chars":4096},"cells_cut":0,"cells_raw":0,"read":"whole","date_system":"1900"}

{"sheet":"Quick Quote Tool","index":0,"n_rows":21,"n_cols":9,"rows_kept":21,"cut":false,"hidden":true,"merged":[[2,1,2,8]]}
[]
[]
[null,"Quote Tool"]
[]
[null,"Category","Product","Per","Setup Fee","MRC","Quantity","Setup Fee - \nSubtotal","MRC - \nSubtotal"]
[null,null,null,{"$f":"IF(ISNA(VLOOKUP(C6,RateCard,3,FALSE)),\"\",(VLOOKUP(C6,RateCard,3,FALSE)))","v":""},{"$f":"IF(ISNA(VLOOKUP(C6,RateCard,6,FALSE)),\"\",(VLOOKUP(C6,RateCard,6,FALSE)))","v":""},{"$f":"IF(ISNA(VLOOKUP(C6,RateCard,7,FALSE)),\"\",(VLOOKUP(C6,RateCard,7,FALSE)))","v":""},null,{"$f":"IF(ISNUMBER(E6*G6), E6*G6, \"\")","v":""},{"$f":"IF(ISNUMBER(F6*G6), F6*G6, \"\")","v":""}]
{"$rows_left_out":16}
{"sheet":"Quote","index":1,"n_rows":71,"n_cols":29,"rows_kept":71,"cut":false,"hidden":false,"merged":[[29,21,29,23],[30,21,30,23],[28,24,28,25],[29,24,29,25],[30,24,30,25],[35,5,35,14],[33,24,33,25],[34,24,34,25],[36,5,36,14],[37,5,37,14],[28,0,28,4],[29,0,29,4],[30,0,30,4],[28,5,28,14],[26,5,26,14],[27,5,27,14],[31,5,31,14],[32,5,32,14],[33,5,33,14],[34,5,34,14],[29,5,29,14],[30,5,30,14],[32,0,32,4],[33,0,33,4],[34,0,34,4],[35,0,35,4],[25,0,25,4],[26,0,26,4],[27,0,27,4],[31,0,31,4],[17,0,17,4],[18,0,18,4],[19,0,19,4],[20,0,20,4],[21,0,21,4],[22,0,22,4],[19,24,19,25],[20,24,20,25],[21,24,21,25],[49,4,49,14],[50,4,50,14],[7,4,7,9],[23,16,23,20],[24,16,24,20],[17,16,17,20],[18,16,18,20],[19,16,19,20],[7,13,7,18],[16,22,16,25],[17,24,17,25],[16,17,16,18],[16,19,16,21],[33,21,33,23],[34,21,34,23],[35,21,35,23],[39,24,39,25],[26,24,26,25],[27,24,27,25],[31,24,31,25],[32,24,32,25],[67,0,67,6],[10,13,10,19],[11,13,11,19],[12,13,12,19],[14,14,14,17],[9,4,9,9],[10,4,10,9],[11,4,11,9],[12,4,12,9],[34,16,34,20],[38,0,38,4],[17,5,17,14],[18,5,18,14],[19,5,19,14],[20,5,20,14],[21,5,21,14],[22,5,22,14],[23,5,23,14],[24,5,24,14],[25,5,25,14],[36,0,36,4],[37,0,37,4],[23,0,23,4],[24,0,24,4],[5,4,5,15],[6,4,6,15],[14,5,14,8],[9,13,9,19],[36,16,36,20],[37,16,37,20],[36,21,36,23],[37,21,37,23],[66,0,66,5],[50,18,50,28],[41,0,45,30],[66,28,66,31],[35,16,35,20],[66,18,66,25],[66,26,66,27],[38,18,38,19],[39,26,39,30],[49,18,49,28],[20,16,20,20],[21,16,21,20],[22,16,22,20],[23,21,23,23],[22,26,22,30],[22,24,22,25],[36,26,36,30],[37,26,37,30],[38,27,38,31],[18,26,18,30],[7,22,7,24],[14,26,14,27],[16,27,16,31],[8,21,8,31],[17,26,17,30],[18,24,18,25],[32,26,32,30],[32,21,32,23],[28,21,28,23],[38,25,38,26],[35,26,35,30],[33,26,33,30],[35,24,35,25],[36,24,36,25],[37,24,37,25],[23,24,23,25],[38,23,38,24],[20,21,20,23],[21,21,21,23],[22,21,22,23],[1,25,1,29],[9,23,9,29],[10,23,10,29],[11,23,11,29],[12,23,12,29],[17,21,17,23],[18,21,18,23],[19,21,19,23],[33,16,33,20],[27,16,27,20],[31,16,31,20],[27,21,27,23],[31,21,31,23],[24,24,24,25],[25,24,25,25],[28,16,28,20],[25,16,25,20],[26,16,26,20],[24,21,24,23],[25,21,25,23],[26,21,26,23],[32,16,32,20],[29,16,29,20],[30,16,30,20],[23,26,23,30],[24,26,24,30],[25,26,25,30],[34,26,34,30],[19,26,19,30],[20,26,20,30],[21,26,21,30],[26,26,26,30],[27,26,27,30],[31,26,31,30],[28,26,28,30],[29,26,29,30],[30,26,30,30]]}
[]
[null,null,null,null,null,null,null,null,null,null,null,null,null,null,null,null,null,null,null,null,null,null,"Date Prepared"]
[]
[]
[]
[null,null,"Name"]
{"$rows_left_out":66}
{"sheet":"Rate Card","index":2,"n_rows":78,"n_cols":12,"rows_kept":78,"cut":false,"hidden":false,"merged":[[5,11,15,11],[72,1,72,9],[76,1,76,9],[73,1,73,9],[77,1,78,9],[74,1,74,2],[75,1,75,2]]}
[]
[null,null,null,null,null,null,null,null,"NRC Margin","MRC Margin"]
[null,null,null,null,null,null,null,null,0,0.6]
[null,null,null,null,null,null,"Partner"]
[null,"SKU","nGenx Product Name","Notes","Partner Product Name","Per","NRC\n(Buy Rate)","MRC\n(Buy Rate)","NRC\n(Partner Price)","MRC\n(Partner Price)",null,"Instructions"]
[null,"GEN","Workspace_Products",null,null,null,null,null,null,null,null,"Enter your Product Names in the \"Partner Product Name\" column.  Enter your pricing in the \"NRC (Partner Price)\" and \"MRC (Partner Price)\" columns.\n\nNote: Your Partner Product Name will appear on the \"Price Quote\" in place of the nGenx Product Name.  If the Partner Product Name is not specified, the \"Price Quote\" will default to the nGenx Product Name.\n\nBundling: If there are multiple nGenx Products that you bundle into one Product, enter that Product name next to each element included in the bundle.  Enter the total bundled price for only one element in the bundle.  Be sure that the prices for all other bundled elements are set to $0."]
{"$rows_left_out":73}
{"sheet":"KEY FEATURES","index":3,"n_rows":27,"n_cols":1,"rows_kept":27,"cut":false,"hidden":false,"merged":[]}
["nWorkspace Key Features. "]
["Windows 8 Experience"]
["Active Directory"]
["Windows File Server"]
["Terminal Server(s) 2012 R2 Operating System"]
["Unlimited Application Installations"]
{"$rows_left_out":22}
{"sheet":"General Questionnaire","index":4,"n_rows":191,"n_cols":12,"rows_kept":191,"cut":false,"hidden":true,"merged":[[12,7,12,9],[5,3,5,6],[10,7,10,9],[1,1,1,9],[5,7,5,9],[6,7,6,9],[8,7,8,9],[132,11,136,11],[131,3,131,8],[29,11,73,11],[141,11,150,11],[82,7,82,9],[83,7,83,9],[84,7,84,9],[89,3,89,8],[78,11,105,11],[77,3,77,9],[78,7,78,9],[79,7,79,9],[80,7,80,9],[155,11,190,11],[154,3,154,7],[20,11,24,11],[9,7,9,9],[6,11,15,11],[109,3,109,8],[19,3,19,8],[28,3,28,8],[7,7,7,9],[110,11,127,11],[81,7,81,9],[11,7,11,9],[13,7,13,9],[14,7,14,9],[15,7,15,9],[140,3,140,7]]}
[]
[null,"General Questionnaire"]
[]
[null,null,"Company Information"]
[]
[null,null,null,"Section",null,null,null,"Response",null,null,null,"Notes"]
{"$rows_left_out":186}
{"sheet":"App Questionnaire","index":5,"n_rows":46,"n_cols":6,"rows_kept":46,"cut":false,"hidden":true,"merged":[[2,4,2,5],[4,4,4,5],[5,4,5,5]]}
[]
[null,null,"App Questionnaire"]
[]
[]
[null,null,"Application #1 - "]
[null,null,null,null,"Application #1"]
{"$rows_left_out":41}
{"sheet":"Server Questionnaire","index":6,"n_rows":30,"n_cols":10,"rows_kept":30,"cut":false,"hidden":true,"merged":[[11,5,11,8],[12,5,12,8],[2,4,2,9],[5,4,5,9],[7,4,7,8],[8,5,8,8],[10,5,10,8]]}
[]
[null,null,"Server Questionnaire"]
[]
[]
[null,null,"Server #1"]
[null,null,null,null,"Server #1"]
{"$rows_left_out":25}
{"sheet":"Summary - Manual","index":7,"n_rows":119,"n_cols":6,"rows_kept":119,"cut":false,"hidden":true,"merged":[]}
[]
[]
[null,null,null,"Order Summary"]
[]
[null,null,"Product","Per","Quantity","Notes"]
[null,null,"nFinity Quick Launch™","named user"]
{"$rows_left_out":114}
{"sheet":"Dropdown","index":8,"n_rows":645,"n_cols":23,"rows_kept":645,"cut":false,"hidden":true,"merged":[]}
["App Name","App Number","App Full-Name","Server Number","App Type","Client Operating System Support","Citrix/RDS/TS Support","Vendor Support Contract","Yes/No","Licensing Model","Licensing Enforcement Model","Install Media/File Type","Install Language","Pre-populated service types","Additional Services?","Add/Remove Service","Proposed Design","CPU","RAM","HDD ","HDD for App","Server OS Support","App Services"]
[{"$f":"IF(ISBLANK(INDEX('App Questionnaire'!$10:$10,1,2*(ROW(A1)-1)+COLUMN(AppHeaderCell) + 1)), \"\", (INDEX('App Questionnaire'!$10:$10,1,2*(ROW(A1)-1)+COLUMN(AppHeaderCell) + 1)))","v":""},{"$f":"IF(ISBLANK(INDEX('App Questionnaire'!$6:$6,1,2*(ROW(A1)-1)+COLUMN(AppHeaderCell) + 1)), \"\", (INDEX('App Questionnaire'!$6:$6,1,2*(ROW(A1)-1)+COLUMN(AppHeaderCell) + 1)))","v":"Application #1"},"MS Office - All Apps",{"$f":"IF(ISBLANK(INDEX('Server Questionnaire'!$6:$6,1,6*(ROW(A1)-1)+COLUMN(ServerHeaderCell) + 1)), \"\", (INDEX('Server Questionnaire'!$6:$6,1,6*(ROW(A1)-1)+COLUMN(ServerHeaderCell) + 1)))","v":"Server #1"},"Application - Client (No Server Needed)","Windows Server 2012 R2","Yes","Yes (Paid Support Contract)","Yes","Per Named User","License File","Shipment of Physical Media","English","Database - MS SQL 2008 Standard","Back-up","Add New Service",null,1,2,null,null,"Windows Server 2012 R2","This app DOES NOT connect to any services"]
[{"$f":"IF(ISBLANK(INDEX('App Questionnaire'!$10:$10,1,2*(ROW(A2)-1)+COLUMN(AppHeaderCell) + 1)), \"\", (INDEX('App Questionnaire'!$10:$10,1,2*(ROW(A2)-1)+COLUMN(AppHeaderCell) + 1)))","v":""},{"$f":"IF(ISBLANK(INDEX('App Questionnaire'!$6:$6,1,2*(ROW(A2)-1)+COLUMN(AppHeaderCell) + 1)), \"\", (INDEX('App Questionnaire'!$6:$6,1,2*(ROW(A2)-1)+COLUMN(AppHeaderCell) + 1)))","v":""},"MS Excel",{"$f":"IF(ISBLANK(INDEX('Server Questionnaire'!$6:$6,1,6*(ROW(A2)-1)+COLUMN(ServerHeaderCell) + 1)), \"\", (INDEX('Server Questionnaire'!$6:$6,1,6*(ROW(A2)-1)+COLUMN(ServerHeaderCell) + 1)))","v":""},"Application - Client/Storage (No Server Needed)","Windows Server 2008 R2","Not officially, but it works","N/A (Application is Free)","No","Per Named Device","License Server","Web Download","French","Database - MS SQL 2008 Enterprise","Business Logics","Remove Existing Service","Economy",2,4,20,5,"Windows Server 2008 R2","This app ONLY connects to its own service(s)"]
[{"$f":"IF(ISBLANK(INDEX('App Questionnaire'!$10:$10,1,2*(ROW(A3)-1)+COLUMN(AppHeaderCell) + 1)), \"\", (INDEX('App Questionnaire'!$10:$10,1,2*(ROW(A3)-1)+COLUMN(AppHeaderCell) + 1)))","v":""},{"$f":"IF(ISBLANK(INDEX('App Questionnaire'!$6:$6,1,2*(ROW(A3)-1)+COLUMN(AppHeaderCell) + 1)), \"\", (INDEX('App Questionnaire'!$6:$6,1,2*(ROW(A3)-1)+COLUMN(AppHeaderCell) + 1)))","v":""},"MS Outlook",{"$f":"IF(ISBLANK(INDEX('Server Questionnaire'!$6:$6,1,6*(ROW(A3)-1)+COLUMN(ServerHeaderCell) + 1)), \"\", (INDEX('Server Questionnaire'!$6:$6,1,6*(ROW(A3)-1)+COLUMN(ServerHeaderCell) + 1)))","v":""},"Application - Client/Server(s)","None of above, but Windows 8","No","No",null,"Concurrent User","Contacts Vendor via the WWW","SFTP (File Transfer)","German","Database - MS SQL 2008 Express","Database",null,"Standard",4,8,30,10,"Other - Specify in \"Notes\"","This app ONLY connects to the service(s) of ANOTHER app"]
[{"$f":"IF(ISBLANK(INDEX('App Questionnaire'!$10:$10,1,2*(ROW(A4)-1)+COLUMN(AppHeaderCell) + 1)), \"\", (INDEX('App Questionnaire'!$10:$10,1,2*(ROW(A4)-1)+COLUMN(AppHeaderCell) + 1)))","v":""},{"$f":"IF(ISBLANK(INDEX('App Questionnaire'!$6:$6,1,2*(ROW(A4)-1)+COLUMN(AppHeaderCell) + 1)), \"\", (INDEX('App Questionnaire'!$6:$6,1,2*(ROW(A4)-1)+COLUMN(AppHeaderCell) + 1)))","v":""},"MS Word",{"$f":"IF(ISBLANK(INDEX('Server Questionnaire'!$6:$6,1,6*(ROW(A4)-1)+COLUMN(ServerHeaderCell) + 1)), \"\", (INDEX('Server Questionnaire'!$6:$6,1,6*(ROW(A4)-1)+COLUMN(ServerHeaderCell) + 1)))","v":""},"Plug-in - Client","None of above, but Windows 7 - x64","Not sure",null,null,"Site Licensing","Physical Licensing Dongle","Other - Specify in \"Notes\"","Spanish","Web - IIS","Licensing",null,"Professional",6,12,40,15,null,"This app has its own service(s) AND connects to the service(s) of ANOTHER app"]
[{"$f":"IF(ISBLANK(INDEX('App Questionnaire'!$10:$10,1,2*(ROW(A5)-1)+COLUMN(AppHeaderCell) + 1)), \"\", (INDEX('App Questionnaire'!$10:$10,1,2*(ROW(A5)-1)+COLUMN(AppHeaderCell) + 1)))","v":""},{"$f":"IF(ISBLANK(INDEX('App Questionnaire'!$6:$6,1,2*(ROW(A5)-1)+COLUMN(AppHeaderCell) + 1)), \"\", (INDEX('App Questionnaire'!$6:$6,1,2*(ROW(A5)-1)+COLUMN(AppHeaderCell) + 1)))","v":""},"Internet Explorer",{"$f":"IF(ISBLANK(INDEX('Server Questionnaire'!$6:$6,1,6*(ROW(A5)-1)+COLUMN(ServerHeaderCell) + 1)), \"\", (INDEX('Server Questionnaire'!$6:$6,1,6*(ROW(A5)-1)+COLUMN(ServerHeaderCell) + 1)))","v":""},"Server-Side Application","None of above, but Windows 7 - x32",null,null,null,"No Licensing Required","Honor System",null,"Portuguese","- Add/Remove Custom Service -","Mail generation",null,"Enterprise",8,16,50,20]
{"$rows_left_out":640}
{"sheet":"User Information","index":9,"n_rows":58,"n_cols":5,"rows_kept":58,"cut":false,"hidden":true,"merged":[[4,5,4,8],[4,9,4,13],[1,1,1,10],[2,1,2,3],[3,1,3,3],[4,1,4,4]]}
[]
[null,"Customer Workbook\nUser Info"]
[]
[]
[null,"Basic User Information"]
[null,"#","First Name","Last Name","UPN"]
{"$rows_left_out":53}
{"sheet":"Order Summary","index":10,"n_rows":123,"n_cols":12,"rows_kept":123,"cut":false,"hidden":true,"merged":[[14,3,14,5],[13,3,13,5],[13,6,13,8],[14,6,14,8],[111,4,111,6],[15,1,15,8],[17,1,17,2],[1,1,1,8],[9,3,9,5],[12,3,12,5],[11,3,11,5],[8,5,8,6],[9,6,9,8],[10,6,10,8],[11,6,11,8],[12,6,12,8],[10,3,10,5],[5,1,5,8],[6,2,6,6],[7,2,7,8],[8,2,8,3],[122,6,122,8],[117,1,117,8],[118,1,118,8],[119,2,119,3],[119,5,119,8],[112,1,112,8],[16,1,16,2],[120,2,120,3],[120,5,120,8],[113,1,116,8]]}
[]
[null,"Order Form"]
[]
[null,null,null,null,"Out of Sync"]
[]
[null,"Customer Information"]
{"$rows_left_out":118}
{"sheet":"Instructions","index":11,"n_rows":31,"n_cols":5,"rows_kept":31,"cut":false,"hidden":true,"merged":[[11,2,11,4],[2,1,2,5]]}
[]
[]
[null,"Workbook Instructions"]
[]
[null,null,"Before you begin…"]
[]
{"$rows_left_out":26}
{"sheet":"Price Quote - Manual","index":12,"n_rows":145,"n_cols":25,"rows_kept":145,"cut":false,"hidden":true,"merged":[[4,0,4,3],[4,4,4,26],[5,1,5,12],[5,14,5,21],[5,23,5,26],[0,10,0,26],[1,0,1,26],[2,0,2,26],[3,0,3,3],[3,4,3,20],[3,21,3,23],[3,24,3,26],[6,0,6,3],[6,4,6,9],[6,10,6,17],[6,18,6,22],[6,23,6,26],[7,0,7,3],[7,4,7,9],[7,10,7,17],[7,18,7,22],[7,23,7,26],[8,0,8,3],[8,4,8,9],[8,10,8,17],[8,18,8,22],[8,23,8,26],[9,0,9,3],[9,4,9,9],[9,10,9,17],[9,18,9,22],[9,23,9,26],[12,0,12,3],[12,4,12,9],[12,10,12,17],[12,18,12,22],[12,23,12,26],[13,0,13,26],[10,0,10,3],[10,4,10,9],[10,10,10,17],[10,18,10,22],[10,23,10,26],[11,0,11,3],[11,4,11,9],[11,10,11,17],[11,18,11,22],[11,23,11,26],[14,0,14,26],[15,0,15,6],[15,7,15,9],[15,10,15,26],[16,0,16,12],[16,13,16,14],[16,15,16,17],[16,18,16,20],[16,21,16,23],[16,24,16,26],[18,0,18,12],[18,13,18,14],[18,15,18,17],[18,18,18,20],[18,21,18,23],[18,24,18,26],[17,0,17,12],[17,13,17,14],[17,15,17,17],[17,18,17,20],[17,21,17,23],[17,24,17,26],[20,0,20,12],[20,13,20,14],[20,15,20,17],[20,18,20,20],[20,21,20,23],[20,24,20,26],[19,0,19,12],[19,13,19,14],[19,15,19,17],[19,18,19,20],[19,21,19,23],[19,24,19,26],[22,0,22,12],[22,13,22,14],[22,15,22,17],[22,18,22,20],[22,21,22,23],[22,24,22,26],[21,0,21,12],[21,13,21,14],[21,15,21,17],[21,18,21,20],[21,21,21,23],[21,24,21,26],[24,0,24,12],[24,13,24,14],[24,15,24,17],[24,18,24,20],[24,21,24,23],[24,24,24,26],[23,0,23,12],[23,13,23,14],[23,15,23,17],[23,18,23,20],[23,21,23,23],[23,24,23,26],[26,0,26,12],[26,13,26,14],[26,15,26,17],[26,18,26,20],[26,21,26,23],[26,24,26,26],[25,0,25,12],[25,13,25,14],[25,15,25,17],[25,18,25,20],[25,21,25,23],[25,24,25,26],[28,0,28,12],[28,13,28,14],[28,15,28,17],[28,18,28,20],[28,21,28,23],[28,24,28,26],[27,0,27,12],[27,13,27,14],[27,15,27,17],[27,18,27,20],[27,21,27,23],[27,24,27,26],[30,0,30,12],[30,13,30,14],[30,15,30,17],[30,18,30,20],[30,21,30,23],[30,24,30,26],[29,0,29,12],[29,13,29,14],[29,15,29,17],[29,18,29,20],[29,21,29,23],[29,24,29,26],[32,0,32,12],[32,13,32,14],[32,15,32,17],[32,18,32,20],[32,21,32,23],[32,24,32,26],[31,0,31,12],[31,13,31,14],[31,15,31,17],[31,18,31,20],[31,21,31,23],[31,24,31,26],[34,0,34,12],[34,13,34,14],[34,15,34,17],[34,18,34,20],[34,21,34,23],[34,24,34,26],[33,0,33,12],[33,13,33,14],[33,15,33,17],[33,18,33,20],[33,21,33,23],[33,24,33,26],[36,0,36,12],[36,13,36,14],[36,15,36,17],[36,18,36,20],[36,21,36,23],[36,24,36,26],[35,0,35,12],[35,13,35,14],[35,15,35,17],[35,18,35,20],[35,21,35,23],[35,24,35,26],[38,0,38,12],[38,13,38,14],[38,15,38,17],[38,18,38,20],[38,21,38,23],[38,24,38,26],[37,0,37,12],[37,13,37,14],[37,15,37,17],[37,18,37,20],[37,21,37,23],[37,24,37,26],[40,0,40,12],[40,13,40,14],[40,15,40,17],[40,18,40,20],[40,21,40,23],[40,24,40,26],[39,0,39,12],[39,13,39,14],[39,15,39,17],[39,18,39,20],[39,21,39,23],[39,24,39,26],[42,0,42,12],[42,13,42,14],[42,15,42,17],[42,18,42,20],[42,21,42,23],[42,24,42,26],[41,0,41,12],[41,13,41,14],[41,15,41,17],[41,18,41,20],[41,21,41,23],[41,24,41,26],[44,0,44,12],[44,13,44,14],[44,15,44,17],[44,18,44,20],[44,21,44,23],[44,24,44,26],[43,0,43,12],[43,13,43,14],[43,15,43,17],[43,18,43,20],[43,21,43,23],[43,24,43,26],[46,0,46,12],[46,13,46,14],[46,15,46,17],[46,18,46,20],[46,21,46,23],[46,24,46,26],[45,0,45,12],[45,13,45,14],[45,15,45,17],[45,18,45,20],[45,21,45,23],[45,24,45,26],[48,0,48,12],[48,13,48,14],[48,15,48,17],[48,18,48,20],[48,21,48,23],[48,24,48,26],[47,0,47,12],[47,13,47,14],[47,15,47,17],[47,18,47,20],[47,21,47,23],[47,24,47,26],[50,0,50,12],[50,13,50,14],[50,15,50,17],[50,18,50,20],[50,21,50,23],[50,24,50,26],[49,0,49,12],[49,13,49,14],[49,15,49,17],[49,18,49,20],[49,21,49,23],[49,24,49,26],[52,0,52,12],[52,13,52,14],[52,15,52,17],[52,18,52,20],[52,21,52,23],[52,24,52,26],[51,0,51,12],[51,13,51,14],[51,15,51,17],[51,18,51,20],[51,21,51,23],[51,24,51,26],[54,0,54,12],[54,13,54,14],[54,15,54,17],[54,18,54,20],[54,21,54,23],[54,24,54,26],[53,0,53,12],[53,13,53,14],[53,15,53,17],[53,18,53,20],[53,21,53,23],[53,24,53,26],[56,0,56,12],[96,13,96,14],[96,15,96,17],[96,18,96,20],[96,21,96,23],[96,24,96,26],[55,0,55,12],[95,13,95,14],[95,15,95,17],[95,18,95,20],[95,21,95,23],[95,24,95,26],[58,0,58,12],[55,15,55,17],[56,15,56,17],[55,18,55,20],[56,18,56,20],[55,21,55,23],[56,21,56,23],[55,24,55,26],[56,24,56,26],[57,0,57,12],[60,0,60,12],[57,15,57,17],[59,0,59,12],[63,0,63,12],[62,15,62,17],[61,18,61,20],[62,18,62,20],[61,21,61,23],[62,21,62,23],[74,18,74,20],[63,15,63,17],[64,15,64,17],[63,18,63,20],[64,18,64,20],[63,21,63,23],[64,21,64,23],[67,0,67,12],[66,0,66,12],[65,0,65,12],[67,15,67,17],[67,18,67,20],[67,21,67,23],[62,0,62,12],[59,15,59,17],[60,15,60,17],[59,18,59,20],[58,15,58,17],[57,18,57,20],[58,18,58,20],[57,21,57,23],[58,21,58,23],[57,24,57,26],[58,24,58,26],[67,24,67,26],[73,21,73,23],[61,24,61,26],[62,24,62,26],[60,18,60,20],[59,21,59,23],[60,21,60,23],[59,24,59,26],[60,24,60,26],[64,24,64,26],[65,15,65,17],[66,15,66,17],[65,18,65,20],[66,18,66,20],[65,21,65,23],[66,21,66,23],[65,24,65,26],[61,0,61,12],[61,15,61,17],[100,21,100,23],[100,24,100,26],[97,21,97,23],[97,24,97,26],[90,0,90,12],[89,0,89,12],[91,0,91,12],[99,13,99,14],[99,15,99,17],[99,18,99,20],[99,21,99,23],[99,24,99,26],[98,13,98,14],[98,15,98,17],[98,18,98,20],[98,21,98,23],[64,0,64,12],[98,24,98,26],[97,13,97,14],[97,15,97,17],[97,18,97,20],[63,24,63,26],[66,24,66,26],[102,21,102,23],[102,24,102,26],[68,0,68,12],[68,15,68,17],[68,18,68,20],[68,21,68,23],[101,13,101,14],[101,15,101,17],[101,18,101,20],[101,21,101,23],[101,24,101,26],[68,24,68,26],[88,0,88,12],[87,0,87,12],[74,15,74,17],[76,0,76,12],[73,15,73,17],[77,21,77,23],[77,24,77,26],[100,13,100,14],[100,15,100,17],[100,18,100,20],[76,18,76,20],[79,0,79,12],[107,13,107,14],[107,15,107,17],[107,18,107,20],[107,21,107,23],[74,0,74,12],[82,0,82,12],[81,0,81,12],[84,0,84,12],[83,0,83,12],[86,0,86,12],[85,0,85,12],[106,13,106,14],[106,15,106,17],[106,18,106,20],[105,13,105,14],[105,15,105,17],[105,18,105,20],[104,0,104,12],[90,21,90,23],[90,18,90,20],[105,21,105,23],[78,0,78,12],[77,0,77,12],[72,0,72,12],[69,15,69,17],[70,15,70,17],[69,18,69,20],[70,18,70,20],[69,21,69,23],[70,21,70,23],[69,24,69,26],[70,24,70,26],[70,0,70,12],[69,0,69,12],[71,15,71,17],[72,15,72,17],[71,18,71,20],[72,18,72,20],[71,21,71,23],[72,21,72,23],[71,24,71,26],[72,24,72,26],[71,0,71,12],[80,0,80,12],[74,24,74,26],[73,0,73,12],[75,15,75,17],[76,15,76,17],[77,18,77,20],[77,15,77,17],[75,0,75,12],[75,24,75,26],[76,24,76,26],[73,24,73,26],[75,18,75,20],[73,18,73,20],[75,21,75,23],[76,21,76,23],[74,21,74,23],[78,24,78,26],[79,24,79,26],[79,15,79,17],[79,18,79,20],[79,21,79,23],[78,15,78,17],[78,18,78,20],[78,21,78,23],[118,24,118,26],[117,13,117,14],[117,15,117,17],[117,18,117,20],[117,21,117,23],[117,24,117,26],[113,18,113,20],[113,21,113,23],[113,24,113,26],[116,13,116,14],[116,15,116,17],[116,18,116,20],[116,21,116,23],[116,24,116,26],[115,24,115,26],[114,21,114,23],[114,24,114,26],[113,13,113,14],[113,15,113,17],[109,13,109,14],[111,21,111,23],[111,24,111,26],[110,13,110,14],[112,13,112,14],[91,18,91,20],[91,15,91,17],[109,15,109,17],[109,18,109,20],[109,21,109,23],[109,24,109,26],[108,13,108,14],[103,15,103,17],[103,24,103,26],[104,24,104,26],[103,13,103,14],[108,21,108,23],[108,24,108,26],[105,24,105,26],[107,24,107,26],[106,21,106,23],[106,24,106,26],[83,15,83,17],[84,15,84,17],[83,18,83,20],[110,21,110,23],[110,24,110,26],[87,18,87,20],[88,18,88,20],[89,18,89,20],[87,15,87,17],[88,15,88,17],[80,24,80,26],[81,24,81,26],[120,24,120,26],[82,24,82,26],[94,15,94,17],[92,18,92,20],[93,18,93,20],[91,24,91,26],[92,24,92,26],[80,15,80,17],[80,18,80,20],[80,21,80,23],[89,21,89,23],[85,18,85,20],[86,18,86,20],[85,15,85,17],[89,15,89,17],[90,15,90,17],[90,24,90,26],[86,24,86,26],[87,24,87,26],[88,24,88,26],[89,24,89,26],[85,21,85,23],[119,13,119,14],[119,15,119,17],[119,18,119,20],[119,21,119,23],[119,24,119,26],[81,15,81,17],[82,15,82,17],[94,21,94,23],[83,24,83,26],[84,24,84,26],[85,24,85,26],[93,24,93,26],[94,24,94,26],[108,15,108,17],[108,18,108,20],[81,18,81,20],[82,18,82,20],[81,21,81,23],[82,21,82,23],[83,21,83,23],[84,21,84,23],[118,21,118,23],[112,24,112,26],[84,18,84,20],[121,21,121,23],[86,21,86,23],[87,21,87,23],[88,21,88,23],[92,21,92,23],[93,21,93,23],[120,13,120,14],[120,15,120,17],[120,18,120,20],[120,21,120,23],[91,21,91,23],[112,21,112,23],[115,13,115,14],[115,15,115,17],[115,18,115,20],[115,21,115,23],[103,18,103,20],[103,21,103,23],[104,13,104,14],[104,15,104,17],[104,18,104,20],[104,21,104,23],[86,15,86,17],[111,13,111,14],[126,21,126,23],[125,13,125,14],[125,15,125,17],[125,18,125,20],[125,21,125,23],[124,13,124,14],[124,15,124,17],[124,18,124,20],[124,21,124,23],[122,0,122,12],[121,13,121,14],[121,15,121,17],[121,18,121,20],[92,15,92,17],[93,15,93,17],[126,15,126,17],[126,18,126,20],[118,15,118,17],[118,18,118,20],[114,13,114,14],[114,15,114,17],[114,18,114,20],[112,15,112,17],[112,18,112,20],[110,15,110,17],[110,18,110,20],[102,13,102,14],[102,15,102,17],[102,18,102,20],[94,18,94,20],[103,0,103,12],[111,15,111,17],[111,18,111,20],[128,15,128,17],[128,18,128,20],[128,21,128,23],[128,24,128,26],[128,0,128,12],[127,13,127,14],[127,15,127,17],[121,24,121,26],[126,24,126,26],[125,24,125,26],[124,24,124,26],[123,21,123,23],[123,24,123,26],[122,13,122,14],[122,15,122,17],[122,18,122,20],[122,21,122,23],[122,24,122,26],[123,13,123,14],[123,15,123,17],[123,18,123,20],[126,0,126,12],[127,0,127,12],[126,13,126,14],[131,13,131,14],[130,13,130,14],[123,0,123,12],[124,0,124,12],[125,0,125,12],[105,0,105,12],[106,0,106,12],[107,0,107,12],[108,0,108,12],[109,0,109,12],[110,0,110,12],[111,0,111,12],[112,0,112,12],[113,0,113,12],[114,0,114,12],[115,0,115,12],[116,0,116,12],[128,13,128,14],[118,13,118,14],[117,0,117,12],[118,0,118,12],[119,0,119,12],[120,0,120,12],[121,0,121,12],[134,0,134,12],[134,21,134,23],[134,24,134,26],[135,0,135,26],[136,0,136,26],[137,0,137,26],[134,13,134,20],[127,18,127,20],[127,21,127,23],[127,24,127,26],[132,18,132,20],[132,21,132,23],[132,24,132,26],[131,15,131,17],[131,18,131,20],[131,21,131,23],[131,24,131,26],[130,24,130,26],[129,24,129,26],[129,21,129,23],[133,21,133,23],[133,24,133,26],[132,13,132,14],[132,15,132,17],[142,0,142,2],[142,3,142,12],[142,13,142,14],[142,15,142,26],[144,17,144,26],[138,0,138,26],[139,0,139,26],[140,0,140,26],[141,0,141,2],[141,3,141,12],[141,13,141,14],[141,15,141,26],[130,21,130,23],[93,0,93,12],[94,0,94,12],[95,0,95,12],[96,0,96,12],[92,0,92,12],[133,13,133,14],[133,15,133,17],[133,18,133,20],[129,0,129,12],[130,0,130,12],[131,0,131,12],[132,0,132,12],[133,0,133,12],[129,15,129,17],[129,18,129,20],[130,15,130,17],[130,18,130,20],[97,0,97,12],[98,0,98,12],[99,0,99,12],[100,0,100,12],[101,0,101,12],[102,0,102,12]]}
[null,null,null,null,null,null,null,null,null,null,"Price Quote"]
[]
["Customer Information"]
["Company Name:",null,null,null,null,null,null,null,null,null,null,null,null,null,null,null,null,null,null,null,null,"Existing Account?: "]
["Company Address:"]
["City:",null,null,null,null,null,null,null,null,null,null,null,null,"ST:",null,null,null,null,null,null,null,null,"Zip:"]
{"$rows_left_out":139}